Member #1523324

Member Since: May 17, 2019

Country: United States

  • I did but I find nothing that solve my issue

  • Hello, I tried to do the exemple make bootload with ubuntu 19.04 and the 18.4 but it is not working, but it work with windows. Here the error I get :

    ../../../../../tools/apollo3_scripts/create_cust_image_blob.py --bin bin/example1_edge_test.bin --load-address 0xC000 --magic-num 0xCB -o bin/main_nonsecure_ota --version 0x0 Header Size = 0x80 original app_size 0x487c ( 18556 ) load_address 0xc000 ( 49152 ) app_size 0x487c ( 18556 ) w0 = 0xcb0048fc Security Value 0x10 w2 = 0x10008080 addrWord = 0xc000 versionKeyWord = 0x0 child0/feature = 0xffffffff child1 = 0xffffffff crc = 0x6addcfd1 Writing to file bin/main_nonsecure_ota.bin ../../../../../tools/apollo3_scripts/create_cust_wireupdate_blob.py --load-address 0x20000 --bin bin/main_nonsecure_ota.bin -i 6 -o bin/main_nonsecure_wire --options 0x1 Header Size = 0x60 app_size 0x48fc ( 18684 ) Writing to file bin/main_nonsecure_wire.bin Image from 0x0 to 0x48fc will be loaded at 0x20000 ../../../bsp/tools/uart_wired_update_sparkfun.py -b 921600 /dev/ttyUSB0 -r 1 -f bin/main_nonsecure_wire.bin -i 6 Connecting with Corvette over serial port /dev/ttyUSB0... Sending Hello. No response for command 0x00000000 received bytes 48 ['0x86', '0xd5', '0xa4', '0x80', '0x5', '0x83', '0x80', '0xc0', '0x84', '0x82', '0x80', '0x87', '0x80', '0x81', '0x80', '0xff', '0x5c', '0xe9', '0xff', '0x25', '0x80', '0x20', '0x80', '0x83', '0xfc', '0xb2', '0xff', '0xff', '0xff', '0xff', '0xff', '0xff', '0xff', '0xff', '0xff', '0xff', '0xff', '0xff', '0xff', '0xff', '0xff', '0xff', '0xff', '0xff', '0xff', '0xff', '0xff', '0xff'] Traceback (most recent call last): File "../../../bsp/tools/uart_wired_update_sparkfun.py", line 341, in <module> main() File "../../../bsp/tools/uart_wired_update_sparkfun.py", line 42, in main connect_device(ser) File "../../../bsp/tools/uart_wired_update_sparkfun.py", line 61, in connect_device response = send_command(hello, 88, ser) File "../../../bsp/tools/uart_wired_update_sparkfun.py", line 238, in send_command raise NoResponseError main.NoResponseError make: *** [Makefile:197: bootload] Error 1

    Does someone have an idea ? Thanks

  • hi, I try to test the first example but it did work, I have this:

    Connecting with Corvette over serial port COM4... Sending Hello. No response for command 0x00000000 Traceback (most recent call last): File "C:\Users\tharmika\AmbiqSuite-Rel2.0.0_XKzAWog\AmbiqSuite-Rel2.0.0\boards\SparkFun_Edge_BSP-master\bsp\tools\uart_wired_update_sparkfun.py", line 341, in <module> main() File "C:\Users\tharmika\AmbiqSuite-Rel2.0.0_XKzAWog\AmbiqSuite-Rel2.0.0\boards\SparkFun_Edge_BSP-master\bsp\tools\uart_wired_update_sparkfun.py", line 42, in main connect_device(ser) File "C:\Users\tharmika\AmbiqSuite-Rel2.0.0_XKzAWog\AmbiqSuite-Rel2.0.0\boards\SparkFun_Edge_BSP-master\bsp\tools\uart_wired_update_sparkfun.py", line 61, in connect_device response = send_command(hello, 88, ser) File "C:\Users\tharmika\AmbiqSuite-Rel2.0.0_XKzAWog\AmbiqSuite-Rel2.0.0\boards\SparkFun_Edge_BSP-master\bsp\tools\uart_wired_update_sparkfun.py", line 238, in send_command raise NoResponseError main.NoResponseError make: *** [Makefile:197: bootload] Error 1

    I am sure my devise is in COM 4. Does anyone have an idea?

No public wish lists :(