Member #551979

Member Since: May 6, 2014

Country: United States

  • I am now receiving a new message… Exp6_LineFollowing_IRSensors.ino:16:20: fatal error: RedBot.h: No such file or directory compilation terminated. Error compiling. I have followed both manuals on Arduino’s website and Sparkfuns guide. But it still won’t work.

  • For some reason after following both manuals I still am receiving this message

  • I got this error can anyone help, fast please. Library_Test:39: error: ‘RedBotMotor’ does not name a type Library_Test:43: error: ‘RedBotAccel’ does not name a type Library_Test:46: error: ‘RedBotEncoder’ does not name a type Library_Test:51: error: ‘RedBotSensor’ does not name a type Library_Test:52: error: ‘RedBotSensor’ does not name a type Library_Test:57: error: ‘RedBotBumper’ does not name a type Library_Test:58: error: ‘RedBotBumper’ does not name a type Library_Test:65: error: ‘RedBotSoftwareSerial’ does not name a type Library_Test.ino: In function ‘void setup()’: Library_Test:101: error: ‘swsp’ was not declared in this scope Library_Test.ino: In function ‘void loop()’: Library_Test:118: error: ‘xl’ was not declared in this scope Library_Test:130: error: ‘encoder’ was not declared in this scope Library_Test:130: error: ‘BOTH’ was not declared in this scope Library_Test:134: error: ‘swsp’ was not declared in this scope Library_Test:134: error: ‘encoder’ was not declared in this scope Library_Test:134: error: ‘RIGHT’ was not declared in this scope Library_Test:150: error: ‘motors’ was not declared in this scope Library_Test:179: error: ‘lSen’ was not declared in this scope Library_Test:179: error: ‘rSen’ was not declared in this scope Library_Test:179: error: ‘motors’ was not declared in this scope Library_Test:181: error: ‘rSen’ was not declared in this scope Library_Test:183: error: ‘motors’ was not declared in this scope Library_Test:187: error: ‘lSen’ was not declared in this scope Library_Test:189: error: ‘motors’ was not declared in this scope Library_Test:193: error: ‘lSen’ was not declared in this scope Library_Test:193: error: ‘rSen’ was not declared in this scope Library_Test:195: error: ‘motors’ was not declared in this scope Library_Test:199: error: ‘motors’ was not declared in this scope Library_Test.ino: In function ‘void bump()’: Library_Test:208: error: ‘motors’ was not declared in this scop

  • I was asked from one of my leaders to do a Halloween scare project. One idea I had was to use an ultrasonic sensor to detect when someone walks on my porch. if it detects someone it will play a scary man voice saying “Muhahaha, you walked into my trap!”. I would love to use this lillypad mp3 player for many other projects such as an alarm clock. Thank you!

  • How long until this is back in stock?

No public wish lists :(